{"text_format":"1","workbook":"xlsx","n_sheets":6,"sheets":["Instructions","Executive Summary","SoK Security Program Assessment","How to Score","Tool Mapping","Lookups"],"not_rendered":{"charts":0,"images":1,"macros":0,"external_links":0,"defined_names":1,"comments":0,"pivot_tables":0},"unopened":[],"bounds":{"document_bytes":16777216,"sheet_cells":100000,"rows_first":2000,"rows_last":500,"rows_between":2000,"halvings":0,"cell_chars":16384,"cell_head_chars":4096},"cells_cut":0,"cells_raw":0,"read":"whole","date_system":"1900"}

{"sheet":"Instructions","index":0,"n_rows":10,"n_cols":4,"rows_kept":10,"cut":false,"hidden":false,"merged":[[9,0,27,15],[0,3,8,15]]}
[null,null,null,"State of Kansas Information Security Self Assessment"]
[]
[]
[]
[]
[]
[]
[]
[]
["This self assessment template has been built to assist the organization in performing a self assessment of its information security program.  This assessment is based on both  State statutes and information security policies.  This assessment uses a simple Yes or No model to assist in measuring the security program and its maturity level.  Through a list of requirements pulled from both the Kansas Cybersecurity Act of 2018 and ITEC 7230A, a score is determined based on assessor's feels a requirement is met or not.  Questions can be answered \"Yes,\"  \"No,\" or \"Not Applicable,\"  which translates to a 0 - 1 numerical value.  Once each section is completed, scores will be averaged to develop an \"average section score\".  Finally, all sections will be averaged to develop an overall perceived maturity level.\n\nUtilizing this tool over the course of several assessments can help develop a picture or trend of the progress of the organization's information security program.\n\nIf there are any questions questions, please do not hesitate to ask and contact the KISO office.\nkiso@ks.gov\n\nThis self assessment when filled, and supporting docments are deemed CONFIDENTIAL under K.S.A 75-7240"]

{"sheet":"Executive Summary","index":1,"n_rows":23,"n_cols":4,"rows_kept":23,"cut":false,"hidden":false,"merged":[[1,0,3,4],[5,2,5,4],[17,2,17,4],[18,2,18,4],[6,2,6,4],[7,2,7,4],[8,2,8,4],[9,2,9,4],[10,2,10,4],[11,2,11,4],[12,2,12,4],[13,2,13,4],[14,2,14,4],[15,2,15,4],[16,2,16,4]]}
["Executive Summary"]
["This scorecard gives you a general ovarall picture of compliance and maturity of compliance with the Kansas Cybersercurity Act and the 2019 version of ITEC 7230a.  It is important to  understand that compliance doesn't equate to complete security.  Security is an ongoing and evolving process.  Your organization should be taking additional steps that might not be fully addressed or recognized by either the KCA or ITEC 7230a.  "]
[]
[]
[]
["***KCA Executive Branch Agency Head Responsibilities","***KCA ->",{"$f":"'SoK Security Program Assessment'!F5","v":0}]
["6.0  RISK MANAGEMENT STANDARD","Total Score for Section 6.0 ->",{"$f":"'SoK Security Program Assessment'!F26","v":0}]
["7.0 ASSESSMENT AND SECURITY PLANNING STANDARD","Total Score for Section 7.0->",{"$f":"'SoK Security Program Assessment'!F47","v":0}]
["8.0 AWARENESS AND TRAINING STANDARD","Total Score for Section 8.0 ->",{"$f":"'SoK Security Program Assessment'!F55","v":0}]
["9.0 ACCESS CONTROL STANDARD","Total Score for Section 9.0->",{"$f":"'SoK Security Program Assessment'!F74","v":0}]
["10.0 SYSTEMS CONFIGURATION STANDARD","Total Score for Section 10.0->",{"$f":"'SoK Security Program Assessment'!F133","v":0}]
["11.0 DATA PROTECTION STANDARD","Total Score for Section 11.0->",{"$f":"'SoK Security Program Assessment'!F156","v":0}]
["12.0 APPLICATION PROCESSING STANDARD","Total Score for Section 12.0->",{"$f":"'SoK Security Program Assessment'!F167","v":0}]
["13.0 SYSTEMS OPERATIONS STANDARD","Total Score for Section 13.0->",{"$f":"'SoK Security Program Assessment'!F170","v":0}]
["14.0 SYSTEM AUDIT STANDARD","Total Score for Section 14.0->",{"$f":"'SoK Security Program Assessment'!F193","v":0}]
["15.0 INCIDENT RESPONSE STANDARD","Total Score for Seciton 15.0->",{"$f":"'SoK Security Program Assessment'!F207","v":0}]
["16.0 PHYSICAL SECUIRTY STANDARD","Total Score for Section 16.0->",{"$f":"'SoK Security Program Assessment'!F225","v":0}]
["17.0 PERSONNEL SECURITY STANDARDS","Total Score for Section 17.0->",{"$f":"'SoK Security Program Assessment'!F236","v":0}]
["18.0 SECURE PURCHASING/ACQUISITION STANDARD","Total Score for Section 18.0->",{"$f":"'SoK Security Program Assessment'!F248","v":0}]
["THE END -- overall average ------>",null,null,{"$f":"AVERAGE(C6:C19)","v":0}]
[]
[]
["*** KCA is the Kansas Cybersecurity Act of 2018"]

{"sheet":"SoK Security Program Assessment","index":2,"n_rows":251,"n_cols":8,"rows_kept":251,"cut":false,"hidden":false,"merged":[[210,4,216,4],[210,5,216,5],[108,4,111,4],[108,5,111,5],[117,7,117,9],[118,7,118,9],[122,7,122,9],[123,7,123,9],[124,7,124,9],[112,7,112,9],[113,7,113,9],[114,7,114,9],[115,7,115,9],[116,7,116,9],[132,7,132,9],[133,7,133,9],[134,7,134,9],[135,7,135,9],[136,7,136,9],[126,7,126,9],[127,7,127,9],[129,7,129,9],[131,7,131,9],[142,7,142,9],[172,3,174,3],[143,3,148,3],[169,5,169,6],[170,5,170,6],[181,5,181,6],[186,5,186,6],[192,5,192,6],[206,5,206,6],[166,5,166,6],[162,5,162,6],[155,5,155,6],[172,4,174,4],[172,5,174,5],[149,5,149,6],[194,4,199,4],[194,5,199,5],[31,3,38,3],[39,3,40,3],[28,3,30,3],[60,3,72,3],[88,3,98,3],[99,3,107,3],[108,3,111,3],[112,3,115,3],[60,4,72,4],[99,4,107,4],[60,5,72,5],[88,4,98,4],[88,5,98,5],[99,5,107,5],[112,4,115,4],[112,5,115,5],[143,4,148,4],[143,5,148,5],[0,1,1,1],[25,5,25,6],[46,5,46,6],[54,5,54,6],[73,5,73,6],[74,5,74,6],[116,5,116,6],[132,5,132,6],[133,5,133,6],[139,5,139,6],[0,4,0,9],[1,4,1,9],[2,4,2,9],[25,7,25,9],[26,7,26,9],[27,7,27,9],[28,7,28,9],[29,7,29,9],[30,7,30,9],[31,7,31,9],[250,5,250,6],[241,5,241,6],[247,5,247,6],[47,5,47,6],[51,5,51,6],[55,5,55,6],[123,5,123,6],[224,5,224,6],[225,5,225,6],[235,5,235,6],[236,5,236,6],[42,7,42,9],[43,7,43,9],[44,7,44,9],[41,7,41,9],[37,7,37,9],[38,7,38,9],[39,7,39,9],[40,7,40,9],[32,7,32,9],[33,7,33,9],[34,7,34,9],[35,7,35,9],[36,7,36,9],[49,7,49,9],[50,7,50,9],[51,7,51,9],[52,7,52,9],[53,7,53,9],[45,7,45,9],[46,7,46,9],[47,7,47,9],[48,7,48,9],[59,7,59,9],[60,7,60,9],[61,7,61,9],[62,7,62,9],[63,7,63,9],[54,7,54,9],[55,7,55,9],[56,7,56,9],[57,7,57,9],[58,7,58,9],[69,7,69,9],[70,7,70,9],[71,7,71,9],[72,7,72,9],[73,7,73,9],[64,7,64,9],[65,7,65,9],[66,7,66,9],[67,7,67,9],[68,7,68,9],[87,7,87,9],[108,7,108,9],[109,7,109,9],[110,7,110,9],[111,7,111,9],[85,7,85,9],[86,7,86,9],[74,7,74,9],[75,7,75,9],[76,7,76,9],[77,7,77,9],[143,7,143,9],[144,7,144,9],[145,7,145,9],[146,7,146,9],[137,7,137,9],[138,7,138,9],[139,7,139,9],[140,7,140,9],[141,7,141,9],[152,7,152,9],[153,7,153,9],[154,7,154,9],[155,7,155,9],[156,7,156,9],[147,7,147,9],[148,7,148,9],[162,7,162,9],[150,7,150,9],[151,7,151,9],[149,7,149,9],[167,7,167,9],[168,7,168,9],[169,7,169,9],[170,7,170,9],[171,7,171,9],[157,7,157,9],[158,7,158,9],[160,7,160,9],[161,7,161,9],[166,7,166,9],[163,7,163,9],[182,7,182,9],[183,7,183,9],[184,7,184,9],[185,7,185,9],[186,7,186,9],[175,7,175,9],[177,7,177,9],[178,7,178,9],[180,7,180,9],[181,7,181,9],[193,7,193,9],[194,7,194,9],[195,7,195,9],[196,7,196,9],[197,7,197,9],[187,7,187,9],[188,7,188,9],[189,7,189,9],[190,7,190,9],[192,7,192,9],[206,7,206,9],[207,7,207,9],[208,7,208,9],[198,7,198,9],[200,7,200,9],[201,7,201,9],[203,7,203,9],[205,7,205,9],[211,7,211,9],[209,7,209,9],[210,7,210,9],[224,7,224,9],[249,7,249,9],[241,7,241,9],[242,7,242,9],[243,7,243,9],[244,7,244,9],[245,7,245,9],[236,7,236,9],[237,7,237,9],[238,7,238,9],[239,7,239,9],[240,7,240,9],[25,10,25,12],[26,10,26,12],[27,10,27,12],[28,10,28,12],[29,10,29,12],[246,7,246,9],[247,7,247,9],[248,7,248,9],[235,7,235,9],[230,7,230,9],[231,7,231,9],[232,7,232,9],[233,7,233,9],[234,7,234,9],[225,7,225,9],[226,7,226,9],[227,7,227,9],[228,7,228,9],[229,7,229,9],[42,10,42,12],[39,10,39,12],[40,10,40,12],[41,10,41,12],[35,10,35,12],[36,10,36,12],[37,10,37,12],[38,10,38,12],[30,10,30,12],[31,10,31,12],[32,10,32,12],[33,10,33,12],[34,10,34,12],[47,10,47,12],[58,10,58,12],[59,10,59,12],[60,10,60,12],[61,10,61,12],[43,10,43,12],[44,10,44,12],[45,10,45,12],[46,10,46,12],[57,10,57,12],[52,10,52,12],[53,10,53,12],[54,10,54,12],[55,10,55,12],[56,10,56,12],[48,10,48,12],[49,10,49,12],[50,10,50,12],[51,10,51,12],[67,10,67,12],[68,10,68,12],[69,10,69,12],[70,10,70,12],[71,10,71,12],[62,10,62,12],[63,10,63,12],[64,10,64,12],[65,10,65,12],[66,10,66,12],[85,10,85,12],[86,10,86,12],[87,10,87,12],[108,10,108,12],[109,10,109,12],[77,10,77,12],[72,10,72,12],[73,10,73,12],[74,10,74,12],[75,10,75,12],[76,10,76,12],[115,10,115,12],[116,10,116,12],[117,10,117,12],[118,10,118,12],[122,10,122,12],[110,10,110,12],[111,10,111,12],[112,10,112,12],[113,10,113,12],[114,10,114,12],[131,10,131,12],[132,10,132,12],[133,10,133,12],[134,10,134,12],[123,10,123,12],[124,10,124,12],[126,10,126,12],[127,10,127,12],[129,10,129,12],[140,10,140,12],[141,10,141,12],[142,10,142,12],[143,10,143,12],[144,10,144,12],[135,10,135,12],[136,10,136,12],[137,10,137,12],[138,10,138,12],[139,10,139,12],[150,10,150,12],[151,10,151,12],[152,10,152,12],[153,10,153,12],[154,10,154,12],[145,10,145,12],[146,10,146,12],[147,10,147,12],[148,10,148,12],[149,10,149,12],[162,10,162,12],[161,10,161,12],[166,10,166,12],[167,10,167,12],[168,10,168,12],[169,10,169,12],[155,10,155,12],[156,10,156,12],[157,10,157,12],[158,10,158,12],[160,10,160,12],[163,10,163,12],[180,10,180,12],[181,10,181,12],[182,10,182,12],[183,10,183,12],[184,10,184,12],[170,10,170,12],[171,10,171,12],[175,10,175,12],[177,10,177,12],[178,10,178,12],[190,10,190,12],[192,10,192,12],[193,10,193,12],[194,10,194,12],[195,10,195,12],[185,10,185,12],[186,10,186,12],[187,10,187,12],[188,10,188,12],[189,10,189,12],[203,10,203,12],[205,10,205,12],[206,10,206,12],[207,10,207,12],[196,10,196,12],[197,10,197,12],[198,10,198,12],[200,10,200,12],[201,10,201,12],[209,10,209,12],[210,10,210,12],[211,10,211,12],[208,10,208,12],[229,10,229,12],[230,10,230,12],[231,10,231,12],[232,10,232,12],[224,10,224,12],[225,10,225,12],[226,10,226,12],[227,10,227,12],[15,4,21,4],[15,5,21,5],[15,3,21,3],[210,3,216,3],[194,3,199,3],[248,10,248,12],[249,10,249,12],[0,0,1,0],[244,10,244,12],[245,10,245,12],[246,10,246,12],[247,10,247,12],[239,10,239,12],[240,10,240,12],[241,10,241,12],[242,10,242,12],[243,10,243,12],[235,10,235,12],[236,10,236,12],[237,10,237,12],[238,10,238,12],[233,10,233,12],[234,10,234,12],[228,10,228,12]]}
["Question Number","Requirement\nand location","Name of person completing assessment:"]
[null,null,"Name of department or entity (if applicable):"]
[null,null,"Date completed:"]
[null,"Kansas \nCybersecurity Act\nK.S.A 75-7240 \nSection and Line"]
[null,null,"Executive Branch Agency Head; Responsibilities; reports; training; breach protocol","What to look for:","Overall KCA",{"$f":"AVERAGE(F6:F23)","v":0},null,"Evidence/Explanation"]
[1,"(a)","Agency executive understands they are solely responsible for security of all data and information technology resources under such agency's purview, irrespective of the location of the data or resources.","Assessor should look to ask executives if they are aware of and understand their requirements for information security. ","NO",{"$f":"VLOOKUP(E6,Lookups!$A$2:$B$4,2,FALSE)","v":0}]
[2,"(b)","Ensure that an agency-wide information security program is in place","Organization leadership should affirm a program is in place.  An information security governance charter would be an example.","NO",{"$f":"VLOOKUP(E7,Lookups!$A$2:$B$4,2,FALSE)","v":0}]
[3,"(c) ","Designate an information security officer to administer the agency's information security program that reports directly to executive leadership","Organization should have an appointment letter on file for and ISO or communication appointing one.","NO",{"$f":"VLOOKUP(E8,Lookups!$A$2:$B$4,2,FALSE)","v":0}]
[4,"(d) ","Participate in CISO-sponsored statewide cybersecurity program initiatives and services",null,"NO",{"$f":"VLOOKUP(E9,Lookups!$A$2:$B$4,2,FALSE)","v":0}]
[5,"(e)","Implement policies and standards to ensure that all the agency's data and information technology resources are maintained in compliance with applicable state and federal laws","Agency should have information security policies in place or know to reference ITEC 7230 as their information security policy.","NO",{"$f":"VLOOKUP(E10,Lookups!$A$2:$B$4,2,FALSE)","v":0}]
[6,"(f)","Implement appropriate cost-effective safeguards to reduce, eliminate or recover from identified threats to data and information technology resources",null,"NO",{"$f":"VLOOKUP(E11,Lookups!$A$2:$B$4,2,FALSE)","v":0}]
[7,"(g)","Include all appropriate cybersecurity requirements in the agency's request for proposal specifications for procuring data and information technology systems and services","Agency should have recent RFP or contract available that has a section that addresses cybersecurity requirements.","NO",{"$f":"VLOOKUP(E12,Lookups!$A$2:$B$4,2,FALSE)","v":0}]
[8,"(h)(1)","Submit a cybersecurity vulnerability assessment report to the CISO by October 16 of each even-numbered year","Agency should have a copy of a complete agency vulnerability assessment.","NO",{"$f":"VLOOKUP(E13,Lookups!$A$2:$B$4,2,FALSE)","v":0}]
[9,"(h)(2)","Ensure that the agency conducts annual internal assessments of its security program.","Agency should have a copy of their internal security program assessment (e.g. a completed copy of this document or a previous version).","NO",{"$f":"VLOOKUP(E14,Lookups!$A$2:$B$4,2,FALSE)","v":0}]
[10,"(h)(3)","Prepare or have prepared a summary of the cybersecurity assessment report required in paragraph  excluding information that might put the data or information resources of the agency or its contractors at risk and submit such report to the house of representatives committee on government, technology and security or its successor committee and the senate committee on ways and means","Organization should have a redacted or aggregate summary report of their vulnerability assessment available for review.","NO",{"$f":"VLOOKUP(E15,Lookups!$A$2:$B$4,2,FALSE)","v":0}]
[11,"(i)","Participate in annual agency leadership training to ensure understanding of:","Organization should have record of executives taking awareness course specific to executives (e.g. certificate of completion from KISO executive training, or participating in a KISO sponsored executive symposium).","NO",{"$f":"VLOOKUP(E16,Lookups!$A$2:$B$4,2,FALSE)","v":0}]
[12,"(i)(1)","The information and information systems that support the operations and assets of the agency"]
[13,"(i)(2)","The potential impact of common types of cyberattacks and data breaches on the agency's operations and assets"]
[14,"(i)(3)","How cyber attacks and data breaches on the agency's operations and assets could impact the operations and assets of other governmental entities on the state enterprise network"]
[15,"(i)(4)","How cyber attacks and data breaches occur"]
[16,"(i)(5)","Steps to be undertaken by the executive director or agency head and agency employees to protect their information and information systems"]
[17,"(i)(6)","The annual reporting requirements required of the executive director or agency head"]
[null,"(j)","Agency must understand breach notification requirements outlined in K.S.A. 2018 Supp. 50-7a01 et seq., and amendments thereto, and applicable federal laws and rules and regulations.  In addition that they must notify the CISO not later than 48 hours after the discovery of the breach, suspected breach or unauthorized exposure. If breach, suspected breach or unauthorized exposure involves election data, they must notify the secretary of state","Assessor should ask organization executives if they are aware of their notification requirements.  Additional evidence could be in the inclusion of notification requirements in their incident response policy, plans, procedures, or incident response communication plan.","NO",{"$f":"VLOOKUP(E23,Lookups!$A$2:$B$4,2,FALSE)","v":0}]
[]
[null,"ITEC \n7230A\n(2019)\nSection\nand Line"]
[null,"6.0"," RISK MANAGEMENT STANDARD",null,null,{"$f":"IFERROR(AVERAGE(F27:F46),\"\")","v":0},null,"Evidence/Explanation"]
[{"$f":"IF(ISBLANK(G27),IF(ISBLANK(A26),A4+1,A26+1),\" \")","v":1},6.1,"Entities must develop a hierarchal Information Asset classification standard that assigns appropriate controls to each Information Asset classification. The standard must require the security controls specified in this document to be applied to Restricted-Use Information.","Organization should have a information asset classification (data classification) policy or reference that they use the 7230a standard to classify information assets.","NO",{"$f":"VLOOKUP(E27,Lookups!$A$2:$B$4,2,FALSE)","v":0}]
[{"$f":"IF(ISBLANK(G28),IF(ISBLANK(A27),A5+1,A27+1),\" \")","v":2},6.2,"Entities must also set a default information classification for all information. If no default standard is created, all information must be considered Restricted-Use Information.","Organization should have a information asset classification (data classification) policy or reference that they use the 7230a standard to classify information assets.","NO",{"$f":"VLOOKUP(E28,Lookups!$A$2:$B$4,2,FALSE)","v":0}]
[{"$f":"IF(ISBLANK(G29),IF(ISBLANK(A28),A6+1,A28+1),\" \")","v":3},6.3,"Entities must ensure that Information Asset trustees are appointed for the following Information Assets:","Entities should have a document that indicates who the Information Asset Trustee is.  (This role could also be labeled as the \"Data Owner\", Can use \"Roles and Responsibilities document published on KISO website.)","NO",{"$f":"VLOOKUP(E29,Lookups!$A$2:$B$4,2,FALSE)","v":0}]
[{"$f":"IF(ISBLANK(G30),IF(ISBLANK(A29),A7+1,A29+1),\" \")","v":4},"6.3.1","Intellectual property or",null,"NO",{"$f":"VLOOKUP(E30,Lookups!$A$2:$B$4,2,FALSE)","v":0}]
[{"$f":"IF(ISBLANK(G31),IF(ISBLANK(A30),A9+1,A30+1),\" \")","v":5},"6.3.2","Data compilations that contain or may be projected to contain Source Records on thirty (30) or more individuals of Restricted-Use Information.",null,"NO",{"$f":"VLOOKUP(E31,Lookups!$A$2:$B$4,2,FALSE)","v":0}]
[6,6.4,"Information Asset trustees must perform the following tasks for each information Asset: ","Organization should show that the individual identified as the Information Asset Trustee has seen and understands their role and responsibilities.  (Could use the Roles and Responsibilities document published on the KISO website and have the Trustee sign the document).","NO",{"$f":"VLOOKUP(E32,Lookups!$A$2:$B$4,2,FALSE)","v":0}]
[7,"6.4.1","Determine the potential impact to the affected entity, individuals and the State in the event of a loss of confidentiality, integrity, and availability of the Information Asset.",null,"NO",{"$f":"VLOOKUP(E33,Lookups!$A$2:$B$4,2,FALSE)","v":0}]
[8,"6.4.2","Classify the asset in accordance with the Entity’s Information Asset classification standard.",null,"NO",{"$f":"VLOOKUP(E34,Lookups!$A$2:$B$4,2,FALSE)","v":0}]
[9,"6.4.3","Ensure that the asset is handled in accordance with the Entity’s Information Asset handling standard.",null,"NO",{"$f":"VLOOKUP(E35,Lookups!$A$2:$B$4,2,FALSE)","v":0}]
[10,"6.4.4","Ensure that adverse events are reported to the Entity Information Security Officer (ISO).",null,"NO",{"$f":"VLOOKUP(E36,Lookups!$A$2:$B$4,2,FALSE)","v":0}]
[11,"6.4.5","Appoint Information Asset custodians.",null,"NO",{"$f":"VLOOKUP(E37,Lookups!$A$2:$B$4,2,FALSE)","v":0}]
[12,"6.4.6","Approve all access and use of the Information Asset.",null,"NO",{"$f":"VLOOKUP(E38,Lookups!$A$2:$B$4,2,FALSE)","v":0}]
[13,"6.4.7"," Recertify annually the classification, access, users and custodians of the Information Asset.",null,"NO",{"$f":"VLOOKUP(E39,Lookups!$A$2:$B$4,2,FALSE)","v":0}]
[14,6.5,"Information Asset custodians must perform the following responsibilities:","Organization should show that the individual identified as the Information Asset Custodian has seen and understands their role and responsibilities.  (Could use the Roles and Responsibilities document published on the KISO website)","NO",{"$f":"VLOOKUP(E40,Lookups!$A$2:$B$4,2,FALSE)","v":0}]
{"$rows_left_out":212}
{"sheet":"How to Score","index":3,"n_rows":9,"n_cols":3,"rows_kept":9,"cut":false,"hidden":true,"merged":[[6,2,7,2],[6,1,7,1],[6,0,7,0]]}
[null,"Definitions","NIST"]
[0,"There are no security controls or plans in place. The controls are nonexistent.","Non-existent"]
[1,"Base practices of the control area are generally performed on an ad hoc basis. There is general agreement within the organization that identified actions should be performed, and they are performed when required.  The practices are not formally adopted, tracked, and reported on.  Alternatively, policy has been adopted but is not implemented or is not followd widely through out the entity.","Adhoc control or Documented Policy only"]
[2,"The base requirements for the control area are planned, implemented, and repeatable. A documented policy and documented process or procedure exsits. Implementation of the process and control may to be to varying degrees throughout the entity.","Documented Procedures"]
[3,"The primary distinction from Level 2,documented procedures, is that in addition to being repeatable the processes used are more mature: documented, approved, and implemented organization-wide. Demonstrable entity wide acceptance is required to meet this level and above.","Implementeded Procedures & Controls"]
[4,"The primary distinction from Level 3, Measured Program, is that the process is measured and verified (e.g., auditable).","Measured Program"]
[5,"The primary distinction from Level 4, Prevasive Program, is that the defined, standard processes are regularly reviewed and updated. Improvements reflect an understanding of, and response to, a vulnerability's impact and metrics gathered from autid trails.","Pervasive Program"]
[]
["ISO 21827 https://www.sabs.co.za/content/uploads/files/SANS21827%28colour%29.pdf"]

{"sheet":"Tool Mapping","index":4,"n_rows":191,"n_cols":5,"rows_kept":191,"cut":false,"hidden":true,"merged":[[162,0,163,0],[162,1,163,1],[0,0,0,4],[83,0,85,0],[83,1,85,1],[94,0,95,0],[94,1,95,1]]}
["Assessment Tool Questions* Mapped to ISO and NIST**"]
["Assessment Questions",null,"ISO","NIST Controls","NIST Family"]
[1]
[2]
[3,4.0999999999999996]
[4,4.2]
[null,null,"A.5 Security Policy",null,"AC: Access Control"]
[5,"5.1.1","A.5.1 Information security policy",null,"AT: Awareness and Training "]
[6,"5.1.1","A.5.1.1 Information security policy document ","XX-1 controls","AU: Audit and Accountability"]
[7,"5.1.2","A.5.1.2 Review of the information security policy","XX-1 controls","CA: Security Assessment and Authorization"]
[null,null,"A.6 Organization of information security",null,"CM: Configuration Management"]
[null,null,"A.6.1 Internal",null,"CP: Contingency Planning"]
[8,"6.1.1","A.6.1.1 Management commitment to information security","XX-1 controls, PM-2, PM-3, PM-9; SP 800-39,SP 800-37","IA: Identificaton and Authentication"]
[9,"6.1.2","A.6.1.2 Information security coordination ","CP-2, CP-4, IR-4, PL-1, PL-2, PM-2, SA-2;SP 800-39, SP 800-37","IR: Incident Response"]
[10,"6.1.3","A.6.1.3 Allocation of information security responsibilities ","XX-1 controls, AC-5, AC-6, CM-9, PM-2; SP 800-39, SP 800-37","MP: Media Protection"]
[11,"6.1.4","A.6.1.4 Authorization process for information processing facilities ","CA-1, CA-6, PM-10; SP 800-37","PE: Physical and Environmental Protection"]
[12,"6.1.5","A.6.1.5 Confidentiality agreements ","PL-4, PS-6, SA-9","PL: Planning"]
[13,"6.1.6","A.6.1.6 Contact with authorities ","Multiple controls with contact reference (e.g.,IR-6, SI-5), SP 800-39; SP 800-37","PS: Personnel Security"]
[14,"6.1.7","A.6.1.7 Contact with special interest groups ","AT-5, SI-5","RA: Risk Assessment"]
[15,"6.1.8","A.6.1.8 Independent review of information security","CA-2, CA-7; SP 800-39, SP 800-37","SA: System and Services Acquisition"]
[null,null,"A.6.2 External Parties",null,"SC: System and Communications Protection"]
[16,"6.2.1","A.6.2.1 Identification of risks related to external parties"," CA-3, PM-9, RA-3, SA-1, SA-9, SC-7","SI: System and Information Integrity"]
[17,"6.2.2","A.6.2.2 Addressing security when dealing with customers"," AC-8 , AT-2, PL-4","PM: Program Management"]
[null,null,"A.6.2.3 Addressing security in third party agreements ","AU-16, CA-2, CA-3, PS-7, SA-9"]
[null,null,"A.7 Asset Management"]
[null,null,"A.7.1 Responsibility for assets"]
[18,"7.1.1","A.7.1.1 Inventory of assets ","CM-8, CM-9, PM-5"]
[19,"7.2.1","A.7.1.2 Ownership of assets ","CM-8, CM-9, PM-5"]
[null,null,"A.7.1.3 Acceptable use of assets ","AC-20, PL-4"]
[null,null,"A.7.2 Information Classification"]
[null,null,"A.7.2.1 Classification Guidelines"," RA-2"]
[null,null,"A.7.2.2 Information labeling and handling ","AC-16, MP-2, MP-3, SC-16"]
[null,null,"A.8 Human Resources Security"]
[null,null,"A.8.1 Prior to Employment"]
[null,null,"A.8.1.1 Roles and Responsibilities ","XX-1 controls, AC-5, AC-6, AC-8, AC-20, AT-2, AT-3, CM-9, PL-4, PS-2, PS-6, PS-7, SA-9"]
[null,null,"A.8.1.2 Screening ","PS-3"]
[null,null,"A.8.1.3 Terms and conditions of employment ","AC-20, PL-4, PS-6, PS-7"]
[null,null,"A.8.2 During employment"]
[20,"8.2.1","A.8.2.1 Management responsibilities ","PL-4, PM-13, PM-15, PS-6, PS-7, SA-9"]
[21,"8.2.2","A.8.2.2 Awareness, education, and training ","AT-2, AT-3, IR-2"]
{"$rows_left_out":152}
{"sheet":"Lookups","index":5,"n_rows":4,"n_cols":7,"rows_kept":4,"cut":false,"hidden":false,"merged":[]}
["Description","Value",null,null,null,"Description","Value"]
["NO",0,null,null,null,"YES",1]
["YES",1,null,null,null,"NO",0]
["Not Applicable","Blank"]